BDBM50582655 CHEMBL5092887
SMILES CNCC(=O)N1CCc2[nH]c3c(Cl)c(Cl)cc(-c4ccn(C)n4)c3c2C1
InChI Key InChIKey=FXYAFKZPUXSIIR-UHFFFAOYSA-N
Data  2 IC50
  Tab Delimited (TSV)   2D SDfile   Computed 3D by Vconf -m prep SDfile
Find this compound or compounds like it in BindingDB:
Activity Spreadsheet -- Enzyme Inhibition Constant Data from BindingDB
Found 2 hits for monomerid = 50582655
TargetCyclic GMP-AMP synthase(Mus musculus)
Shanghai Institute Of Materia Medica (Simm)
Curated by ChEMBL
LigandPNGBDBM50582655(CHEMBL5092887)
Affinity DataIC50:  2.19E+4nM. Assay description: Inhibition of mouse cGAS expressed in RAW-Lucia ISG transfected with HT-DNA assessed as suppression of lipofectamine 2000:ds-DNA complex induced acti...
Ligand InfoPC cidPC sid
In DepthDetails ArticlePubMed
TargetCyclic GMP-AMP synthase(Homo sapiens)
Shanghai Institute Of Materia Medica (Simm)
Curated by ChEMBL
LigandPNGBDBM50582655(CHEMBL5092887)
Affinity DataIC50:  6.30E+3nM. Assay description: Inhibition of human cGAS expressed in THP1-Dual cells transfected with HT-DNA assessed as suppression of lipofectamine 2000:ds-DNA complex induced ac...
Ligand InfoPC cidPC sid
In DepthDetails ArticlePubMed