BDBM50582834 CHEMBL5086296
SMILES CN(C)c1ccc(\C=C\c2ccccc2NC(=O)c2cccnn2)cc1
InChI Key InChIKey=BBAKBLZYYOLQCS-FMIVXFBMSA-N
Data  1 Kd
  Tab Delimited (TSV)   2D SDfile   Computed 3D by Vconf -m prep SDfile
Find this compound or compounds like it in BindingDB:
Activity Spreadsheet -- Enzyme Inhibition Constant Data from BindingDB
Found 1 hit for monomerid = 50582834
TargetAlpha-synuclein(Homo sapiens (Human))
Fudan University
Curated by ChEMBL
LigandPNGBDBM50582834(CHEMBL5086296)
Affinity DataKd:  140nM. Assay description: Binding affinity to recombinant human alpha-syn aggregates assessed as dissociation constant by SPR analysis
Ligand InfoPC cidPC sid
In DepthDetails ArticlePubMed