BDBM50582846 CHEMBL5088083
SMILES COc1ccc(\C=C\c2ccccc2NC(=O)c2ccccn2)cc1
InChI Key InChIKey=WHYPTCGOHMETLL-FMIVXFBMSA-N
Data  1 Kd
  Tab Delimited (TSV)   2D SDfile   Computed 3D by Vconf -m prep SDfile
Find this compound or compounds like it in BindingDB:
Activity Spreadsheet -- Enzyme Inhibition Constant Data from BindingDB
Found 1 hit for monomerid = 50582846
TargetAlpha-synuclein(Homo sapiens (Human))
Fudan University
Curated by ChEMBL
LigandPNGBDBM50582846(CHEMBL5088083)
Affinity DataKd:  70nM. Assay description: Binding affinity to recombinant human alpha-syn aggregates assessed as dissociation constant by SPR analysis
Ligand InfoPC cidPC sid
In DepthDetails ArticlePubMed