BDBM50583234 CHEMBL5091352
SMILES CC(C)[C@H](NC(=O)[C@H](CC(N)=O)NC(=O)[C@H](Cc1ccc(O)cc1)NC(=O)CNC(=O)[C@H](CCC(O)=O)NC(=O)[C@H](CCCCN)NC(=O)[C@H](C)NC(=O)[C@@H](NC(=O)[C@H](C)N)[C@@H](C)O)C(=O)N[C@@H](Cc1ccc(OP(O)(O)=O)cc1)C(=O)NCC(O)=O
InChI Key InChIKey=KNYSLGYWRXBXHS-NQGNDLBJSA-N
Data  1 KI
  Tab Delimited (TSV)   2D SDfile   Computed 3D by Vconf -m prep SDfile
Find this compound or compounds like it in BindingDB:
Activity Spreadsheet -- Enzyme Inhibition Constant Data from BindingDB
Found 1 hit for monomerid = 50583234
TargetTyrosine-protein phosphatase non-receptor type 5(Homo sapiens (Human))
Institute Of Biochemistry Of The Romanian Academy
Curated by ChEMBL
LigandPNGBDBM50583234(CHEMBL5091352)
Affinity DataKi:  5.35E+3nM. Assay description: Inhibition of TAM-3Y-F2Pmp peptide binding to N-terminal His6-fused STEP32 (282 to 563 residues) (unknown origin) expressed in Escherichia coli BL21(...
Ligand InfoPC cidPC sid
In DepthDetails ArticlePubMed