BDBM50583726 CHEMBL5092022
SMILES Nc1cc(cc(N)n1)-c1ccc2nccn2c1
InChI Key InChIKey=QLPORDOIWOOPCV-UHFFFAOYSA-N
Data  1 IC50
  Tab Delimited (TSV)   2D SDfile   Computed 3D by Vconf -m prep SDfile
Find this compound or compounds like it in BindingDB:
Activity Spreadsheet -- Enzyme Inhibition Constant Data from BindingDB
Found 1 hit for monomerid = 50583726
TargetDual specificity tyrosine-phosphorylation-regulated kinase 1A(Homo sapiens (Human))
Servier Research Institute Of Medicinal Chemistry
Curated by ChEMBL
LigandPNGBDBM50583726(CHEMBL5092022)
Affinity DataIC50:  17nM. Assay description: Inhibition of DYRK1A (unknown origin) using Ulight-MBP as substrate and ATP as co-substrate incubated for 40 mins and measured after 1 hr by TR-FRET ...
Ligand InfoPC cidPC sid
In DepthDetails ArticlePubMed