BDBM50584107 CHEMBL5077567
SMILES NCCNC(=O)c1cc(nc2[nH]ncc12)-c1ccc(NS(=O)(=O)c2cccc(Cl)c2Cl)cc1
InChI Key InChIKey=XPRFOBRHUXXIHQ-UHFFFAOYSA-N
Data  2 IC50
  Tab Delimited (TSV)   2D SDfile   Computed 3D by Vconf -m prep SDfile
Find this compound or compounds like it in BindingDB:
Activity Spreadsheet -- Enzyme Inhibition Constant Data from BindingDB
Found 2 hits for monomerid = 50584107
TargetSerine/threonine-protein kinase Sgk1(Homo sapiens (Human))
Sanofi R&D
Curated by ChEMBL
LigandPNGBDBM50584107(CHEMBL5077567)
Affinity DataIC50: <1nM. Assay description: Inhibition of recombinant human SGK1 expressed in baculovirus expression system using 5-carboxyfluorescein -RPRAATF-NH2 as substrate preincubated for...
Ligand InfoPC cidPC sid
In DepthDetails ArticlePubMed
TargetSerine/threonine-protein kinase Sgk1(Homo sapiens (Human))
Sanofi R&D
Curated by ChEMBL
LigandPNGBDBM50584107(CHEMBL5077567)
Affinity DataIC50: <1nM. Assay description: Inhibition of recombinant human SGK1 expressed in baculovirus expression system using 5-carboxyfluorescein -RPRAATF-NH2 as substrate preincubated for...
Ligand InfoPC cidPC sid
In DepthDetails ArticlePubMed