BDBM50584111 CHEMBL5090286
SMILES CCN1CCC(CNC(=O)c2cc(nc3[nH]ncc23)-c2ccc(NS(=O)(=O)c3cccc(Cl)c3Cl)cc2)C1
InChI Key InChIKey=CYRGTVQWOVBNGK-UHFFFAOYSA-N
Data  2 IC50
  Tab Delimited (TSV)   2D SDfile   Computed 3D by Vconf -m prep SDfile
Find this compound or compounds like it in BindingDB:
Activity Spreadsheet -- Enzyme Inhibition Constant Data from BindingDB
Found 2 hits for monomerid = 50584111
TargetSerine/threonine-protein kinase Sgk1(Homo sapiens (Human))
Sanofi R&D
Curated by ChEMBL
LigandPNGBDBM50584111(CHEMBL5090286)
Affinity DataIC50:  109nM. Assay description: Inhibition of recombinant human SGK1 expressed in baculovirus expression system using 5-carboxyfluorescein -RPRAATF-NH2 as substrate preincubated for...
Ligand InfoPC cidPC sid
In DepthDetails ArticlePubMed
TargetSerine/threonine-protein kinase Sgk1(Homo sapiens (Human))
Sanofi R&D
Curated by ChEMBL
LigandPNGBDBM50584111(CHEMBL5090286)
Affinity DataIC50: <1nM. Assay description: Inhibition of recombinant human SGK1 expressed in baculovirus expression system using 5-carboxyfluorescein -RPRAATF-NH2 as substrate preincubated for...
Ligand InfoPC cidPC sid
In DepthDetails ArticlePubMed