BDBM50584117 CHEMBL5075362
SMILES Clc1cccc(c1Cl)S(=O)(=O)Nc1ccc(cc1)-c1cc(C(=O)NCc2ncn[nH]2)c2cn[nH]c2n1
InChI Key InChIKey=IWRKWNOQFFAQLD-UHFFFAOYSA-N
Data  2 IC50
  Tab Delimited (TSV)   2D SDfile   Computed 3D by Vconf -m prep SDfile
Find this compound or compounds like it in BindingDB:
Activity Spreadsheet -- Enzyme Inhibition Constant Data from BindingDB
Found 2 hits for monomerid = 50584117
TargetSerine/threonine-protein kinase Sgk1(Homo sapiens (Human))
Sanofi R&D
Curated by ChEMBL
LigandPNGBDBM50584117(CHEMBL5075362)
Affinity DataIC50:  107nM. Assay description: Inhibition of recombinant human SGK1 expressed in baculovirus expression system using 5-carboxyfluorescein -RPRAATF-NH2 as substrate preincubated for...
Ligand InfoPC cidPC sid
In DepthDetails ArticlePubMed
TargetSerine/threonine-protein kinase Sgk1(Homo sapiens (Human))
Sanofi R&D
Curated by ChEMBL
LigandPNGBDBM50584117(CHEMBL5075362)
Affinity DataIC50:  1nM. Assay description: Inhibition of recombinant human SGK1 expressed in baculovirus expression system using 5-carboxyfluorescein -RPRAATF-NH2 as substrate preincubated for...
Ligand InfoPC cidPC sid
In DepthDetails ArticlePubMed