BDBM50584864 CHEMBL5079595
SMILES COC(=O)c1cc(NC(=O)c2cnn3cccnc23)cc(c1)C(=O)OC
InChI Key InChIKey=VYCMSOZMAHLHBL-UHFFFAOYSA-N
Data  3 IC50  9 EC50
  Tab Delimited (TSV)   2D SDfile   Computed 3D by Vconf -m prep SDfile
Find this compound or compounds like it in BindingDB:
Activity Spreadsheet -- Enzyme Inhibition Constant Data from BindingDB
Found 12 hits for monomerid = 50584864
TargetStimulator of interferon genes protein(Human)
Bristol Myers Squibb Research And Development
Curated by ChEMBL
LigandPNGBDBM50584864(CHEMBL5079595)
Affinity DataEC50:  3.70E+3nM. Assay description: Agonist activity at STING in human THP1 Dual cells assessed as IRF reporter activation incubated for 20 hrs by quanti-blue SEAP reporter gene assay
Ligand InfoPC cidPC sid
In DepthDetails ArticlePubMed
TargetStimulator of interferon genes protein(Mus musculus)
Bristol Myers Squibb Research And Development
Curated by ChEMBL
LigandPNGBDBM50584864(CHEMBL5079595)
Affinity DataEC50: >1.00E+5nM. Assay description: Agonist activity at STING in mouse RAW-Lucia ISG cells assessed as IRF reporter activation incubated for 20 hrs by quanti-blue SEAP reporter gene ass...
Ligand InfoPC cidPC sid
In DepthDetails ArticlePubMed
TargetStimulator of interferon genes protein(Human)
Bristol Myers Squibb Research And Development
Curated by ChEMBL
LigandPNGBDBM50584864(CHEMBL5079595)
Affinity DataEC50: >1.00E+5nM. Assay description: Agonist activity at STING in human THP1 Dual KO-STING cells assessed as IRF reporter activation incubated for 20 hrs by quanti-blue SEAP reporter gen...
Ligand InfoPC cidPC sid
In DepthDetails ArticlePubMed
TargetStimulator of interferon genes protein(Mus musculus)
Bristol Myers Squibb Research And Development
Curated by ChEMBL
LigandPNGBDBM50584864(CHEMBL5079595)
Affinity DataEC50: >1.00E+5nM. Assay description: Agonist activity at STING in mouse RAW-Lucia ISG-KO-STING cells assessed as IRF reporter activation incubated for 20 hrs by quanti-blue SEAP reporter...
Ligand InfoPC cidPC sid
In DepthDetails ArticlePubMed
TargetStimulator of interferon genes protein(Human)
Bristol Myers Squibb Research And Development
Curated by ChEMBL
LigandPNGBDBM50584864(CHEMBL5079595)
Affinity DataEC50:  3.50E+3nM. Assay description: Agonist activity at STING in human THP1-Dual cells assessed as NF-kappaB reporter activation incubated for 20 hrs by quanti-blue SEAP reporter gene a...
Ligand InfoPC cidPC sid
In DepthDetails ArticlePubMed
TargetStimulator of interferon genes protein(Mus musculus)
Bristol Myers Squibb Research And Development
Curated by ChEMBL
LigandPNGBDBM50584864(CHEMBL5079595)
Affinity DataEC50: >1.00E+5nM. Assay description: Binding affinity to wild type mouse His-tagged STING cytoplasmic domain (155 to 341 residues) assessed as induction of protein dimerization incubated...
Ligand InfoPC cidPC sid
In DepthDetails ArticlePubMed
TargetStimulator of interferon genes protein(Human)
Bristol Myers Squibb Research And Development
Curated by ChEMBL
LigandPNGBDBM50584864(CHEMBL5079595)
Affinity DataIC50: >1.00E+5nM. Assay description: Displacement of fluorescein-labelled probe from wild type human His-tagged STING cytoplasmic domain (155 to 341 residues) by time-resolved FRET-based...
Ligand InfoPC cidPC sid
In DepthDetails ArticlePubMed
TargetStimulator of interferon genes protein(Mus musculus)
Bristol Myers Squibb Research And Development
Curated by ChEMBL
LigandPNGBDBM50584864(CHEMBL5079595)
Affinity DataIC50: >1.00E+5nM. Assay description: Displacement of fluorescein-labelled probe from wild type mouse His-tagged STING cytoplasmic domain (155 to 341 residues) by time-resolved FRET-based...
Ligand InfoPC cidPC sid
In DepthDetails ArticlePubMed
TargetStimulator of interferon genes protein(Human)
Bristol Myers Squibb Research And Development
Curated by ChEMBL
LigandPNGBDBM50584864(CHEMBL5079595)
Affinity DataIC50: >1.00E+5nM. Assay description: Displacement of fluorescein-labelled probe from human cytoplasmic domain of STING G230A/R293Q double mutant (155 to 341 residues) by time-resolved FR...
Ligand InfoPC cidPC sid
In DepthDetails ArticlePubMed
TargetStimulator of interferon genes protein(Human)
Bristol Myers Squibb Research And Development
Curated by ChEMBL
LigandPNGBDBM50584864(CHEMBL5079595)
Affinity DataEC50: >1.00E+5nM. Assay description: Binding affinity to wild type human His-tagged STING cytoplasmic domain (155 to 341 residues) assessed as induction of protein dimerization incubated...
Ligand InfoPC cidPC sid
In DepthDetails ArticlePubMed
TargetStimulator of interferon genes protein(Human)
Bristol Myers Squibb Research And Development
Curated by ChEMBL
LigandPNGBDBM50584864(CHEMBL5079595)
Affinity DataEC50: >1.00E+5nM. Assay description: Binding affinity to human STING G230A/R293Q double mutant cytoplasmic domain (155 to 341 residues) assessed as induction of protein dimerization incu...
Ligand InfoPC cidPC sid
In DepthDetails ArticlePubMed
TargetStimulator of interferon genes protein(Human)
Bristol Myers Squibb Research And Development
Curated by ChEMBL
LigandPNGBDBM50584864(CHEMBL5079595)
Affinity DataEC50: >1.00E+5nM. Assay description: Agonist activity at STING in human THP1-Dual KO-STING cells assessed as NF-kappaB reporter activation incubated for 20 hrs by quanti-blue SEAP report...
Ligand InfoPC cidPC sid
In DepthDetails ArticlePubMed