BDBM50584867 CHEMBL5089143
SMILES OC(=O)c1cccc2cc(CNC(=O)c3cnn4cccnc34)oc12
InChI Key InChIKey=BICDHWPHEXMVAT-UHFFFAOYSA-N
Data  3 IC50  9 EC50
PDB links: 1 PDB ID matches this monomer.
  Tab Delimited (TSV)   2D SDfile   Computed 3D by Vconf -m prep SDfile
Find this compound or compounds like it in BindingDB:
Activity Spreadsheet -- Enzyme Inhibition Constant Data from BindingDB
Found 12 hits for monomerid = 50584867
TargetStimulator of interferon genes protein(Human)
Bristol Myers Squibb Research And Development
Curated by ChEMBL
LigandPNGBDBM50584867(CHEMBL5089143)
Affinity DataEC50: >1.00E+5nM. Assay description: Agonist activity at STING in human THP1 Dual cells assessed as IRF reporter activation incubated for 20 hrs by quanti-blue SEAP reporter gene assay
TargetStimulator of interferon genes protein(Mus musculus)
Bristol Myers Squibb Research And Development
Curated by ChEMBL
LigandPNGBDBM50584867(CHEMBL5089143)
Affinity DataEC50: >1.00E+5nM. Assay description: Agonist activity at STING in mouse RAW-Lucia ISG cells assessed as IRF reporter activation incubated for 20 hrs by quanti-blue SEAP reporter gene ass...
In DepthDetails ArticlePubMed
TargetStimulator of interferon genes protein(Human)
Bristol Myers Squibb Research And Development
Curated by ChEMBL
LigandPNGBDBM50584867(CHEMBL5089143)
Affinity DataEC50: >1.00E+5nM. Assay description: Agonist activity at STING in human THP1 Dual KO-STING cells assessed as IRF reporter activation incubated for 20 hrs by quanti-blue SEAP reporter gen...
TargetStimulator of interferon genes protein(Mus musculus)
Bristol Myers Squibb Research And Development
Curated by ChEMBL
LigandPNGBDBM50584867(CHEMBL5089143)
Affinity DataEC50: >1.00E+5nM. Assay description: Agonist activity at STING in mouse RAW-Lucia ISG-KO-STING cells assessed as IRF reporter activation incubated for 20 hrs by quanti-blue SEAP reporter...
In DepthDetails ArticlePubMed
TargetStimulator of interferon genes protein(Human)
Bristol Myers Squibb Research And Development
Curated by ChEMBL
LigandPNGBDBM50584867(CHEMBL5089143)
Affinity DataEC50: >1.00E+5nM. Assay description: Agonist activity at STING in human THP1-Dual cells assessed as NF-kappaB reporter activation incubated for 20 hrs by quanti-blue SEAP reporter gene a...
TargetStimulator of interferon genes protein(Human)
Bristol Myers Squibb Research And Development
Curated by ChEMBL
LigandPNGBDBM50584867(CHEMBL5089143)
Affinity DataIC50:  4.00E+4nM. Assay description: Displacement of fluorescein-labelled probe from wild type human His-tagged STING cytoplasmic domain (155 to 341 residues) by time-resolved FRET-based...
TargetStimulator of interferon genes protein(Mus musculus)
Bristol Myers Squibb Research And Development
Curated by ChEMBL
LigandPNGBDBM50584867(CHEMBL5089143)
Affinity DataIC50:  1.10E+3nM. Assay description: Displacement of fluorescein-labelled probe from wild type mouse His-tagged STING cytoplasmic domain (155 to 341 residues) by time-resolved FRET-based...
In DepthDetails ArticlePubMed
TargetStimulator of interferon genes protein(Human)
Bristol Myers Squibb Research And Development
Curated by ChEMBL
LigandPNGBDBM50584867(CHEMBL5089143)
Affinity DataIC50:  1.40E+4nM. Assay description: Displacement of fluorescein-labelled probe from human cytoplasmic domain of STING G230A/R293Q double mutant (155 to 341 residues) by time-resolved FR...
TargetStimulator of interferon genes protein(Human)
Bristol Myers Squibb Research And Development
Curated by ChEMBL
LigandPNGBDBM50584867(CHEMBL5089143)
Affinity DataEC50:  7.10E+4nM. Assay description: Binding affinity to wild type human His-tagged STING cytoplasmic domain (155 to 341 residues) assessed as induction of protein dimerization incubated...
TargetStimulator of interferon genes protein(Human)
Bristol Myers Squibb Research And Development
Curated by ChEMBL
LigandPNGBDBM50584867(CHEMBL5089143)
Affinity DataEC50:  5.00E+4nM. Assay description: Binding affinity to human STING G230A/R293Q double mutant cytoplasmic domain (155 to 341 residues) assessed as induction of protein dimerization incu...
TargetStimulator of interferon genes protein(Mus musculus)
Bristol Myers Squibb Research And Development
Curated by ChEMBL
LigandPNGBDBM50584867(CHEMBL5089143)
Affinity DataEC50:  1.40E+4nM. Assay description: Binding affinity to wild type mouse His-tagged STING cytoplasmic domain (155 to 341 residues) assessed as induction of protein dimerization incubated...
In DepthDetails ArticlePubMed
TargetStimulator of interferon genes protein(Human)
Bristol Myers Squibb Research And Development
Curated by ChEMBL
LigandPNGBDBM50584867(CHEMBL5089143)
Affinity DataEC50: >1.00E+5nM. Assay description: Agonist activity at STING in human THP1-Dual KO-STING cells assessed as NF-kappaB reporter activation incubated for 20 hrs by quanti-blue SEAP report...