BDBM50584874 CHEMBL5081567
SMILES OC(=O)c1c(O)c(Cl)cc2cc(CNC(=O)c3cnn4cccnc34)oc12
InChI Key InChIKey=SWKCGRQWBFXVOO-UHFFFAOYSA-N
Data  3 IC50  5 EC50
  Tab Delimited (TSV)   2D SDfile   Computed 3D by Vconf -m prep SDfile
Find this compound or compounds like it in BindingDB:
Activity Spreadsheet -- Enzyme Inhibition Constant Data from BindingDB
Found 8 hits for monomerid = 50584874
TargetStimulator of interferon genes protein(Human)
Bristol Myers Squibb Research And Development
Curated by ChEMBL
LigandPNGBDBM50584874(CHEMBL5081567)
Affinity DataEC50:  7.70E+4nM. Assay description: Agonist activity at STING in human THP1 Dual cells assessed as IRF reporter activation incubated for 20 hrs by quanti-blue SEAP reporter gene assay
Ligand InfoPC cidPC sid
In DepthDetails ArticlePubMed
TargetStimulator of interferon genes protein(Mus musculus)
Bristol Myers Squibb Research And Development
Curated by ChEMBL
LigandPNGBDBM50584874(CHEMBL5081567)
Affinity DataEC50:  1.90E+4nM. Assay description: Agonist activity at STING in mouse RAW-Lucia ISG cells assessed as IRF reporter activation incubated for 20 hrs by quanti-blue SEAP reporter gene ass...
Ligand InfoPC cidPC sid
In DepthDetails ArticlePubMed
TargetStimulator of interferon genes protein(Human)
Bristol Myers Squibb Research And Development
Curated by ChEMBL
LigandPNGBDBM50584874(CHEMBL5081567)
Affinity DataIC50:  2.50E+3nM. Assay description: Displacement of fluorescein-labelled probe from wild type human His-tagged STING cytoplasmic domain (155 to 341 residues) by time-resolved FRET-based...
Ligand InfoPC cidPC sid
In DepthDetails ArticlePubMed
TargetStimulator of interferon genes protein(Mus musculus)
Bristol Myers Squibb Research And Development
Curated by ChEMBL
LigandPNGBDBM50584874(CHEMBL5081567)
Affinity DataEC50:  3.30E+3nM. Assay description: Binding affinity to wild type mouse His-tagged STING cytoplasmic domain (155 to 341 residues) assessed as induction of protein dimerization incubated...
Ligand InfoPC cidPC sid
In DepthDetails ArticlePubMed
TargetStimulator of interferon genes protein(Human)
Bristol Myers Squibb Research And Development
Curated by ChEMBL
LigandPNGBDBM50584874(CHEMBL5081567)
Affinity DataIC50:  580nM. Assay description: Displacement of fluorescein-labelled probe from human cytoplasmic domain of STING G230A/R293Q double mutant (155 to 341 residues) by time-resolved FR...
Ligand InfoPC cidPC sid
In DepthDetails ArticlePubMed
TargetStimulator of interferon genes protein(Human)
Bristol Myers Squibb Research And Development
Curated by ChEMBL
LigandPNGBDBM50584874(CHEMBL5081567)
Affinity DataEC50:  9.20E+3nM. Assay description: Binding affinity to wild type human His-tagged STING cytoplasmic domain (155 to 341 residues) assessed as induction of protein dimerization incubated...
Ligand InfoPC cidPC sid
In DepthDetails ArticlePubMed
TargetStimulator of interferon genes protein(Human)
Bristol Myers Squibb Research And Development
Curated by ChEMBL
LigandPNGBDBM50584874(CHEMBL5081567)
Affinity DataEC50:  6.00E+3nM. Assay description: Binding affinity to human STING G230A/R293Q double mutant cytoplasmic domain (155 to 341 residues) assessed as induction of protein dimerization incu...
Ligand InfoPC cidPC sid
In DepthDetails ArticlePubMed
TargetStimulator of interferon genes protein(Mus musculus)
Bristol Myers Squibb Research And Development
Curated by ChEMBL
LigandPNGBDBM50584874(CHEMBL5081567)
Affinity DataIC50:  230nM. Assay description: Displacement of fluorescein-labelled probe from wild type mouse His-tagged STING cytoplasmic domain (155 to 341 residues) by time-resolved FRET-based...
Ligand InfoPC cidPC sid
In DepthDetails ArticlePubMed