BDBM50584879 CHEMBL5092039
SMILES C[C@H](NC(=O)c1cnn2cccnc12)c1cc2cc(Cl)cc(C(O)=O)c2o1
InChI Key InChIKey=YZKSSMUQCVHHEA-VIFPVBQESA-N
Data  3 IC50  3 EC50
  Tab Delimited (TSV)   2D SDfile   Computed 3D by Vconf -m prep SDfile
Find this compound or compounds like it in BindingDB:
Activity Spreadsheet -- Enzyme Inhibition Constant Data from BindingDB
Found 6 hits for monomerid = 50584879
TargetStimulator of interferon genes protein(Human)
Bristol Myers Squibb Research And Development
Curated by ChEMBL
LigandPNGBDBM50584879(CHEMBL5092039)
Affinity DataIC50:  7.80E+4nM. Assay description: Displacement of fluorescein-labelled probe from wild type human His-tagged STING cytoplasmic domain (155 to 341 residues) by time-resolved FRET-based...
Ligand InfoPC cidPC sid
In DepthDetails ArticlePubMed
TargetStimulator of interferon genes protein(Mus musculus)
Bristol Myers Squibb Research And Development
Curated by ChEMBL
LigandPNGBDBM50584879(CHEMBL5092039)
Affinity DataIC50:  1.70E+4nM. Assay description: Displacement of fluorescein-labelled probe from wild type mouse His-tagged STING cytoplasmic domain (155 to 341 residues) by time-resolved FRET-based...
Ligand InfoPC cidPC sid
In DepthDetails ArticlePubMed
TargetStimulator of interferon genes protein(Mus musculus)
Bristol Myers Squibb Research And Development
Curated by ChEMBL
LigandPNGBDBM50584879(CHEMBL5092039)
Affinity DataEC50:  5.20E+4nM. Assay description: Binding affinity to wild type mouse His-tagged STING cytoplasmic domain (155 to 341 residues) assessed as induction of protein dimerization incubated...
Ligand InfoPC cidPC sid
In DepthDetails ArticlePubMed
TargetStimulator of interferon genes protein(Human)
Bristol Myers Squibb Research And Development
Curated by ChEMBL
LigandPNGBDBM50584879(CHEMBL5092039)
Affinity DataEC50: >1.00E+5nM. Assay description: Binding affinity to wild type human His-tagged STING cytoplasmic domain (155 to 341 residues) assessed as induction of protein dimerization incubated...
Ligand InfoPC cidPC sid
In DepthDetails ArticlePubMed
TargetStimulator of interferon genes protein(Human)
Bristol Myers Squibb Research And Development
Curated by ChEMBL
LigandPNGBDBM50584879(CHEMBL5092039)
Affinity DataEC50:  6.40E+4nM. Assay description: Binding affinity to human STING G230A/R293Q double mutant cytoplasmic domain (155 to 341 residues) assessed as induction of protein dimerization incu...
Ligand InfoPC cidPC sid
In DepthDetails ArticlePubMed
TargetStimulator of interferon genes protein(Human)
Bristol Myers Squibb Research And Development
Curated by ChEMBL
LigandPNGBDBM50584879(CHEMBL5092039)
Affinity DataIC50:  3.40E+4nM. Assay description: Displacement of fluorescein-labelled probe from human cytoplasmic domain of STING G230A/R293Q double mutant (155 to 341 residues) by time-resolved FR...
Ligand InfoPC cidPC sid
In DepthDetails ArticlePubMed