BDBM50586344 CHEMBL5073894
SMILES C[C@@H]1Cc2c(C[C@H]1c1c(F)c(N)ccc1C(F)(F)F)nc(OC[C@@H]1CCCN1C)nc2N1CCN(C[C@@H]1C)C(=O)C=C
InChI Key InChIKey=OZRZEEUJBJSHEU-FUMNGEBKSA-N
Data  1 IC50  1 EC50
  Tab Delimited (TSV)   2D SDfile   Computed 3D by Vconf -m prep SDfile
Find this compound or compounds like it in BindingDB:
Activity Spreadsheet -- Enzyme Inhibition Constant Data from BindingDB
Found 2 hits for monomerid = 50586344
TargetGTPase KRas(Homo sapiens (Human))
Usona Institute
Curated by ChEMBL
LigandPNGBDBM50586344(CHEMBL5073894)
Affinity DataEC50:  6.60nM. Assay description: Inhibition of KRAS G12C mutant in human HCC1171 cells assessed as effect on cell alkylation measured after 18 hrs by western blot analysis
Ligand InfoPC cidPC sid
In DepthDetails ArticlePubMed
TargetGTPase KRas(Homo sapiens (Human))
Usona Institute
Curated by ChEMBL
LigandPNGBDBM50586344(CHEMBL5073894)
Affinity DataIC50: <10nM. Assay description: Inhibition of KRAS G12C mutant (2 to 188 residues) (unknown origin) expressed in Escherichia coli assessed as inhibition of SOS mediated nucleotide e...
Ligand InfoPC cidPC sid
In DepthDetails ArticlePubMed