BDBM50586367 CHEMBL5089144
SMILES CC(C)C[C@H](NC(=O)[C@H](Cc1ccccc1)NC(=O)[C@H](CO)NC(=O)[C@H](CCCNC(N)=N)NC(=O)[C@@H]1CCCN1)C(=O)N[C@@H](C(C)C)C(=O)N[C@@H](CCCNC(N)=N)C(=O)N[C@@H](CCCCN)C(=O)N[C@@H](CCCNC(N)=N)C(O)=O
InChI Key InChIKey=OHEPTDQYIRPUFG-LCQMPJFHSA-N
Data  1 KI
  Tab Delimited (TSV)   2D SDfile   Computed 3D by Vconf -m prep SDfile
Find this compound or compounds like it in BindingDB:
Activity Spreadsheet -- Enzyme Inhibition Constant Data from BindingDB
Found 1 hit for monomerid = 50586367
TargetLysine-specific histone demethylase 1A(Homo sapiens (Human))
Nagoya City University
Curated by ChEMBL
LigandPNGBDBM50586367(CHEMBL5089144)
Affinity DataKi:  100nM. Assay description: Inhibition of human LSD1 using K4me2 peptide as substrate measured after 10 mins by peroxidase-coupled reaction assay
Ligand InfoPC cidPC sid
In DepthDetails ArticlePubMed