BDBM50586724 CHEMBL5082666
SMILES [O-][N+](=O)CC(c1c([nH]c2ccccc12)-c1ccsc1)c1ccccc1
InChI Key InChIKey=NCOQFHIDDWOEMQ-UHFFFAOYSA-N
Data  1 KI  4 EC50
  Tab Delimited (TSV)   2D SDfile   Computed 3D by Vconf -m prep SDfile
Find this compound or compounds like it in BindingDB:
Activity Spreadsheet -- Enzyme Inhibition Constant Data from BindingDB
Found 5 hits for monomerid = 50586724
TargetCannabinoid receptor 1(Homo sapiens (Human))
Northeastern University
Curated by ChEMBL
LigandPNGBDBM50586724(CHEMBL5082666)
Affinity DataKi:  43nM. Assay description: Displacement of [3H]CP55940 from human CB1 receptor expressed in CHO-K1 cell membranes incubated for 60 mins by liquid scintillation spectrometry ana...
In DepthDetails ArticlePubMed
TargetCannabinoid receptor 1(Homo sapiens (Human))
Northeastern University
Curated by ChEMBL
LigandPNGBDBM50586724(CHEMBL5082666)
Affinity DataEC50:  320nM. Assay description: Positive allosteric modulation of human CB1 receptor expressed in CHO-K1 cells assessed as beta-arrestin 2 recruitment incubated for 90 mins by PathH...
In DepthDetails ArticlePubMed
TargetCannabinoid receptor 1(Mus musculus (Mouse))
Northeastern University
Curated by ChEMBL
LigandPNGBDBM50586724(CHEMBL5082666)
Affinity DataEC50:  30nM. Assay description: Positive allosteric modulation of CB1 receptor in MF1 mouse vas deferens assessed as inhibition of AEA-induced electrically evoked vas deferens contr...
In DepthDetails ArticlePubMed
TargetCannabinoid receptor 1(Homo sapiens (Human))
Northeastern University
Curated by ChEMBL
LigandPNGBDBM50586724(CHEMBL5082666)
Affinity DataEC50:  130nM. Assay description: Agonist activity at human CB1 receptor expressed in CHO cell membranes assessed as increase in [35S]GTPgammaS binding incubated for 30 mins by liquid...
In DepthDetails ArticlePubMed
TargetCannabinoid receptor 1(Homo sapiens (Human))
Northeastern University
Curated by ChEMBL
LigandPNGBDBM50586724(CHEMBL5082666)
Affinity DataEC50:  87nM. Assay description: Positive allosteric modulation of human CB1 receptor expressed in CHO-K1 cells assessed as inhibition of forskolin-induced cAMP production incubated ...
In DepthDetails ArticlePubMed