BDBM50586964 CHEMBL5074984
SMILES CC(C)S(=O)(=O)n1ccc2cc(ccc12)C(=O)NCc1ccc(CS(=O)(=O)C2CC2)cc1C(F)(F)F
InChI Key InChIKey=IVOQJTPYSYFSHB-UHFFFAOYSA-N
Data  1 IC50  1 EC50
  Tab Delimited (TSV)   2D SDfile   Computed 3D by Vconf -m prep SDfile
Find this compound or compounds like it in BindingDB:
Activity Spreadsheet -- Enzyme Inhibition Constant Data from BindingDB
Found 2 hits for monomerid = 50586964
TargetPeroxisome proliferator-activated receptor gamma(Homo sapiens (Human))
Goethe-University
Curated by ChEMBL
LigandPNGBDBM50586964(CHEMBL5074984)
Affinity DataEC50:  1.05E+3nM. Assay description: Partial agonist activity at GAL4-tagged human PPARgamma LBD expressed in HEK293T cells incubated for 12 to 14 hrs by dual-Glo luciferase assay
Ligand InfoPC cidPC sid
In DepthDetails ArticlePubMed
TargetBifunctional epoxide hydrolase 2(Homo sapiens (Human))
Goethe-University
Curated by ChEMBL
LigandPNGBDBM50586964(CHEMBL5074984)
Affinity DataIC50:  2nM. Assay description: Inhibition of recombinant human full length sEH assessed as reduction in 6-methoxy-2-naphthaldehyde formation using PHOME as substrate preincubated f...
Ligand InfoPC cidPC sid
In DepthDetails ArticlePubMed