BDBM50587033 CHEMBL5075478
SMILES CC[C@H](C)[C@H](N)C(=O)N[C@@H](Cc1c[nH]c2ccccc12)C(=O)N[C@@H]([C@@H](C)CC)C(=O)N[C@@H](C)C(=O)N[C@@H](CCC(N)=O)C(=O)N[C@@H](CCC(O)=O)C(=O)N[C@@H](CC(C)C)C(=O)N[C@@H](CCCNC(N)=N)C(=O)N[C@@H](CCCNC(N)=N)C(=O)N[C@@H]([C@@H](C)CC)C(=O)NCC(=O)N[C@@H](CC(O)=O)C(=O)N[C@@H](CCC(O)=O)C(=O)N[C@@H](Cc1ccccc1)C(=O)N[C@@H](CC(N)=O)C(=O)N[C@@H](C)C(=O)N[C@@H](Cc1ccc(O)cc1)C(=O)N[C@@H](Cc1ccc(O)cc1)C(=O)N[C@@H](C)C(=O)N[C@@H](CCCNC(N)=N)C(=O)N[C@@H](CCCNC(N)=N)C(O)=O
InChI Key InChIKey=PIUAOGNUTRDHMM-LWYXPJSDSA-N
Data  2 IC50
  Tab Delimited (TSV)   2D SDfile   Computed 3D by Vconf -m prep SDfile
Find this compound or compounds like it in BindingDB:
Activity Spreadsheet -- Enzyme Inhibition Constant Data from BindingDB
Found 2 hits for monomerid = 50587033
TargetInduced myeloid leukemia cell differentiation protein Mcl-1(Homo sapiens (Human))
University Of California Riverside
Curated by ChEMBL
LigandPNGBDBM50587033(CHEMBL5075478)
Affinity DataIC50:  22nM. Assay description: Inhibition of human Mcl-1 (179 to 323 residues) expressed in Escherichia coli BL21 using biotinylated-BH3 peptide as substrate measured after 2 hrs b...
Ligand InfoPC cidPC sid
In DepthDetails ArticlePubMed
TargetBcl-2-related protein A1(Homo sapiens (Human))
University Of California Riverside
Curated by ChEMBL
LigandPNGBDBM50587033(CHEMBL5075478)
Affinity DataIC50:  18nM. Assay description: Inhibition of human Bfl-1 (1 to 149 residues) expressed in Rosetta-gami (DE3) using biotinylated-BH3 peptide as substrate measured after 2 hrs by DEL...
Ligand InfoPC cidPC sid
In DepthDetails ArticlePubMed