BDBM50587081 CHEMBL5087526
SMILES C[C@@H]1NC(=O)[C@@H]2CSSC[C@H](NC(=O)[C@@H](N)CCC(N)=O)C(=O)N[C@@H](CSSC[C@H](NC(=O)[C@H](Cc3cnc[nH]3)NC(=O)[C@H](CCC(O)=O)NC(=O)[C@H](Cc3cnc[nH]3)NC1=O)C(=O)N[C@@H](CCCNC(N)=N)C(O)=O)C(=O)N[C@@H](CO)C(=O)N[C@@H](CC(N)=O)C(=O)N1CCC[C@H]1C(=O)N1CCC[C@H]1C(=O)N2
InChI Key InChIKey=MJXRFYGHQMVCGG-PECUCFMDSA-N
Data  9 IC50
  Tab Delimited (TSV)   2D SDfile   Computed 3D by Vconf -m prep SDfile
Find this compound or compounds like it in BindingDB:
Activity Spreadsheet -- Enzyme Inhibition Constant Data from BindingDB
Found 9 hits for monomerid = 50587081
TargetNeuronal acetylcholine receptor subunit alpha-7(Rattus norvegicus (Rat))
Hainan University
Curated by ChEMBL
LigandPNGBDBM50587081(CHEMBL5087526)
Affinity DataIC50:  1.76E+3nM. Assay description: Antagonist activity at rat alpha7 nAChR expressed in xenopus oocytes assessed as inhibition of Ach- induced response at -70 mV holding potential prei...
Ligand InfoPC cidPC sid
In DepthDetails ArticlePubMed
TargetNeuronal acetylcholine receptor subunit alpha-3/alpha-6/beta-4(Homo sapiens (Human))
Hainan University
Curated by ChEMBL
LigandPNGBDBM50587081(CHEMBL5087526)
Affinity DataIC50: >1.00E+4nM. Assay description: Antagonist activity at rat alpha6/alpha3beta4 nAChR expressed in xenopus oocytes assessed as inhibition of Ach- induced response at -70 mV holding po...
Ligand InfoPC cidPC sid
In DepthDetails ArticlePubMed
TargetNeuronal acetylcholine receptor subunit alpha-3/beta-2(Rattus norvegicus (Rat))
Hainan University
Curated by ChEMBL
LigandPNGBDBM50587081(CHEMBL5087526)
Affinity DataIC50: >1.00E+4nM. Assay description: Antagonist activity at rat alpha3beta2 nAChR expressed in xenopus oocytes assessed as inhibition of Ach- induced response at -70 mV holding potential...
Ligand InfoPC cidPC sid
In DepthDetails ArticlePubMed
TargetNeuronal acetylcholine receptor subunit alpha-2/beta-2(Rattus norvegicus (Rat))
Hainan University
Curated by ChEMBL
LigandPNGBDBM50587081(CHEMBL5087526)
Affinity DataIC50: >1.00E+4nM. Assay description: Antagonist activity at rat alpha2beta2 nAChR expressed in xenopus oocytes assessed as inhibition of Ach- induced response at -70 mV holding potential...
Ligand InfoPC cidPC sid
In DepthDetails ArticlePubMed
TargetNicotinic acetylcholine receptor alpha9/alpha10(RAT)
Hainan University
Curated by ChEMBL
LigandPNGBDBM50587081(CHEMBL5087526)
Affinity DataIC50: >1.00E+4nM. Assay description: Antagonist activity at rat alpha9alpha10 nAChR expressed in xenopus oocytes assessed as inhibition of Ach- induced response at -70 mV holding potenti...
Ligand InfoPC cidPC sid
In DepthDetails ArticlePubMed
TargetNeuronal acetylcholine receptor subunit alpha-3/beta-4(Rattus norvegicus (Rat))
Hainan University
Curated by ChEMBL
LigandPNGBDBM50587081(CHEMBL5087526)
Affinity DataIC50: >1.00E+4nM. Assay description: Antagonist activity at rat alpha3beta4 nAChR expressed in xenopus oocytes assessed as inhibition of Ach- induced response at -70 mV holding potential...
Ligand InfoPC cidPC sid
In DepthDetails ArticlePubMed
TargetNeuronal acetylcholine receptor subunit alpha-4/beta-2(Rattus norvegicus (Rat))
Hainan University
Curated by ChEMBL
LigandPNGBDBM50587081(CHEMBL5087526)
Affinity DataIC50: >1.00E+4nM. Assay description: Antagonist activity at rat alpha4beta2 nAChR expressed in xenopus oocytes assessed as inhibition of Ach- induced response at -70 mV holding potential...
Ligand InfoPC cidPC sid
In DepthDetails ArticlePubMed
TargetNeuronal acetylcholine receptor subunit alpha-4/beta-4(Rattus norvegicus (Rat))
Hainan University
Curated by ChEMBL
LigandPNGBDBM50587081(CHEMBL5087526)
Affinity DataIC50: >1.00E+4nM. Assay description: Antagonist activity at rat alpha4beta4 nAChR expressed in xenopus oocytes assessed as inhibition of Ach- induced response at -70 mV holding potential...
Ligand InfoPC cidPC sid
In DepthDetails ArticlePubMed
TargetNeuronal acetylcholine receptor subunit alpha-2/beta-4(Rattus norvegicus (Rat))
Hainan University
Curated by ChEMBL
LigandPNGBDBM50587081(CHEMBL5087526)
Affinity DataIC50: >1.00E+4nM. Assay description: Antagonist activity at rat alpha2beta4 nAChR expressed in xenopus oocytes assessed as inhibition of Ach- induced response at -70 mV holding potential...
Ligand InfoPC cidPC sid
In DepthDetails ArticlePubMed