BDBM50588340 CHEMBL5204910
SMILES Cc1ccc(cc1)C(=O)N1CCC2(CCNCC2)CC1
InChI Key InChIKey=OJPBMIZUSSIFGI-UHFFFAOYSA-N
Data  6 KI  6 IC50
  Tab Delimited (TSV)   2D SDfile   Computed 3D by Vconf -m prep SDfile
Find this compound or compounds like it in BindingDB:
Activity Spreadsheet -- Enzyme Inhibition Constant Data from BindingDB
Found 12 hits for monomerid = 50588340
TargetGamma-aminobutyric acid receptor subunit alpha-4/beta-1/delta(Homo sapiens (Human))
University Of Copenhagen
Curated by ChEMBL
LigandPNGBDBM50588340(CHEMBL5204910)
Affinity DataKi:  1.28E+3nM. Assay description: Antagonist activity at human alpha4beta1delta GABAA receptor expressed in HEK293 Flp-In cells by FMP assay
Ligand InfoPC cidPC sid
In DepthDetails PubMed
TargetGamma-aminobutyric acid receptor subunit alpha-5/beta-2/gamma-2(Homo sapiens (Human))
University Of Copenhagen
Curated by ChEMBL
LigandPNGBDBM50588340(CHEMBL5204910)
Affinity DataKi:  1.50E+3nM. Assay description: Antagonist activity at human alpha5beta2gamma2 GABAA receptor expressed in HEK293 cells by FMP assay
Ligand InfoPC cidPC sid
In DepthDetails PubMed
TargetGamma-aminobutyric acid receptor subunit alpha-3/beta-2/gamma-2(Homo sapiens (Human))
University Of Copenhagen
Curated by ChEMBL
LigandPNGBDBM50588340(CHEMBL5204910)
Affinity DataKi:  3.57E+3nM. Assay description: Antagonist activity at human alpha3beta2gamma2 GABAA receptor expressed in HEK293 cells by FMP assay
Ligand InfoPC cidPC sid
In DepthDetails PubMed
TargetGamma-aminobutyric acid receptor subunit alpha-1/beta-2/gamma-2(Homo sapiens (Human))
University Of Copenhagen
Curated by ChEMBL
LigandPNGBDBM50588340(CHEMBL5204910)
Affinity DataKi:  1.00E+4nM. Assay description: Antagonist activity at human alpha1beta2gamma2 GABAA receptor expressed in HEK293 cells by FMP assay
Ligand InfoPC cidPC sid
In DepthDetails PubMed
TargetGamma-aminobutyric acid receptor subunit alpha-1/beta-2/delta(Homo sapiens (Human))
University Of Copenhagen
Curated by ChEMBL
LigandPNGBDBM50588340(CHEMBL5204910)
Affinity DataKi:  1.32E+4nM. Assay description: Antagonist activity at human alpha1beta2delta GABAA receptor expressed in HEK293 Flp-In cells by FMP assay
Ligand InfoPC cidPC sid
In DepthDetails PubMed
TargetGamma-aminobutyric acid receptor subunit alpha-2/beta-2/gamma-2(Homo sapiens (Human))
University Of Copenhagen
Curated by ChEMBL
LigandPNGBDBM50588340(CHEMBL5204910)
Affinity DataKi:  2.53E+4nM. Assay description: Antagonist activity at human alpha2beta2gamma2 GABAA receptor expressed in HEK293 cells by FMP assay
Ligand InfoPC cidPC sid
In DepthDetails PubMed
TargetGamma-aminobutyric acid receptor subunit alpha-3/beta-2/gamma-2(Homo sapiens (Human))
University Of Copenhagen
Curated by ChEMBL
LigandPNGBDBM50588340(CHEMBL5204910)
Affinity DataIC50:  3.24E+3nM. Assay description: Antagonist activity at human alpha3beta2gamma2 GABAA receptor expressed in HEK293 cells by FMP assay
Ligand InfoPC cidPC sid
In DepthDetails PubMed
TargetGamma-aminobutyric acid receptor subunit alpha-2/beta-2/gamma-2(Homo sapiens (Human))
University Of Copenhagen
Curated by ChEMBL
LigandPNGBDBM50588340(CHEMBL5204910)
Affinity DataIC50:  2.51E+4nM. Assay description: Antagonist activity at human alpha2beta2gamma2 GABAA receptor expressed in HEK293 cells by FMP assay
Ligand InfoPC cidPC sid
In DepthDetails PubMed
TargetGamma-aminobutyric acid receptor subunit alpha-5/beta-2/gamma-2(Homo sapiens (Human))
University Of Copenhagen
Curated by ChEMBL
LigandPNGBDBM50588340(CHEMBL5204910)
Affinity DataIC50:  1.45E+3nM. Assay description: Antagonist activity at human alpha5beta2gamma2 GABAA receptor expressed in HEK293 cells by FMP assay
Ligand InfoPC cidPC sid
In DepthDetails PubMed
TargetGamma-aminobutyric acid receptor subunit alpha-4/beta-1/delta(Homo sapiens (Human))
University Of Copenhagen
Curated by ChEMBL
LigandPNGBDBM50588340(CHEMBL5204910)
Affinity DataIC50:  1.26E+3nM. Assay description: Antagonist activity at human alpha4beta1delta GABAA receptor expressed in HEK293 Flp-In cells by FMP assay
Ligand InfoPC cidPC sid
In DepthDetails PubMed
TargetGamma-aminobutyric acid receptor subunit alpha-1/beta-2/delta(Homo sapiens (Human))
University Of Copenhagen
Curated by ChEMBL
LigandPNGBDBM50588340(CHEMBL5204910)
Affinity DataIC50:  1.32E+4nM. Assay description: Antagonist activity at human alpha1beta2delta GABAA receptor expressed in HEK293 Flp-In cells by FMP assay
Ligand InfoPC cidPC sid
In DepthDetails PubMed
TargetGamma-aminobutyric acid receptor subunit alpha-1/beta-2/gamma-2(Homo sapiens (Human))
University Of Copenhagen
Curated by ChEMBL
LigandPNGBDBM50588340(CHEMBL5204910)
Affinity DataIC50:  1.00E+4nM. Assay description: Antagonist activity at human alpha1beta2gamma2 GABAA receptor expressed in HEK293 cells by FMP assay
Ligand InfoPC cidPC sid
In DepthDetails PubMed