BDBM50588572 CHEMBL5183147
SMILES Oc1cc(cc(c1O)[N+]([O-])=O)C(=O)c1ccc(cc1)C(F)(F)F
InChI Key InChIKey=YJJRYGOORZESBE-UHFFFAOYSA-N
Data  1 Kd
  Tab Delimited (TSV)   2D SDfile   Computed 3D by Vconf -m prep SDfile
Find this compound or compounds like it in BindingDB:
Activity Spreadsheet -- Enzyme Inhibition Constant Data from BindingDB
Found 1 hit for monomerid = 50588572
TargetTransthyretin(Homo sapiens (Human))
Universitat Aut£Noma De Barcelona
Curated by ChEMBL
LigandPNGBDBM50588572(CHEMBL5183147)
Affinity DataKd:  310nM. Assay description: Binding affinity to wild type TTR (unknown origin) assessed as dissociation constant by ITC assay
Ligand InfoPC cidPC sid
In DepthDetails PubMed