BDBM50588629 CHEMBL5170093
SMILES OC1c2ccc(cc2CCC\C1=C/C(O)=O)-c1ccccc1
InChI Key InChIKey=NUTNFGZHQLFKOZ-FOWTUZBSSA-N
Data  6 KI  1 IC50  1 Kd
  Tab Delimited (TSV)   2D SDfile   Computed 3D by Vconf -m prep SDfile
Find this compound or compounds like it in BindingDB:
Activity Spreadsheet -- Enzyme Inhibition Constant Data from BindingDB
Found 8 hits for monomerid = 50588629
TargetCalcium/calmodulin-dependent protein kinase type II subunit alpha(Rattus norvegicus (rat))
University Of Copenhagen
Curated by ChEMBL
LigandPNGBDBM50588629(CHEMBL5170093)
Affinity DataKi:  78nM. Assay description: Displacement of [3H]NCS-382 from CaMK2alpha in rat brain cortical membrane homogenates measured after 1 hr by TopCount scintillation counting method
In DepthDetails PubMed
TargetCalcium/calmodulin-dependent protein kinase type II subunit alpha(Rattus norvegicus (rat))
University Of Copenhagen
Curated by ChEMBL
LigandPNGBDBM50588629(CHEMBL5170093)
Affinity DataKi:  79nM. Assay description: Displacement of [3H]NCS-382 from CaMK2alpha in rat brain cortical membrane homogenates measured after 1 hr by TopCount scintillation counting method
In DepthDetails PubMed
TargetCalcium/calmodulin-dependent protein kinase type II subunit alpha(Rattus norvegicus (rat))
University Of Copenhagen
Curated by ChEMBL
LigandPNGBDBM50588629(CHEMBL5170093)
Affinity DataKi:  140nM. Assay description: Displacement of [3H]HOCPCA from native CaMK2alpha in rat brain cortical membrane homogenates measured after 1 hr by TopCount scintillation counting m...
In DepthDetails PubMed
TargetCalcium/calmodulin-dependent protein kinase type II subunit alpha(Rattus norvegicus (rat))
University Of Copenhagen
Curated by ChEMBL
LigandPNGBDBM50588629(CHEMBL5170093)
Affinity DataKi:  140nM. Assay description: Displacement of [3H]HOCPCA from native CaMK2alpha in rat brain cortical membrane homogenates measured after 1 hr by TopCount scintillation counting m...
In DepthDetails PubMed
TargetCalcium/calmodulin-dependent protein kinase type II subunit alpha(Rattus norvegicus (rat))
University Of Copenhagen
Curated by ChEMBL
LigandPNGBDBM50588629(CHEMBL5170093)
Affinity DataKi:  1.40E+3nM. Assay description: Displacement of [3H]HOCPCA from recombinant rat CaMK2alpha expressed in HEK293T cells measured after 1 hr by liquid scintillation counting method
In DepthDetails PubMed
TargetCalcium/calmodulin-dependent protein kinase type II subunit alpha(Rattus norvegicus (rat))
University Of Copenhagen
Curated by ChEMBL
LigandPNGBDBM50588629(CHEMBL5170093)
Affinity DataKi:  1.40E+3nM. Assay description: Displacement of [3H]HOCPCA from recombinant rat CaMK2alpha expressed in HEK293T cells measured after 1 hr by liquid scintillation counting method
In DepthDetails PubMed
TargetCalcium/calmodulin-dependent protein kinase type II subunit alpha(Homo sapiens (Human))
University Of Copenhagen
Curated by ChEMBL
LigandPNGBDBM50588629(CHEMBL5170093)
Affinity DataKd:  757nM. Assay description: Binding affinity to recombinant human CaMK2alpha 6x hub domain (345 to 475 residues) expressed in Escherichia coli BL21 DE3 assessed as dissociation ...
In DepthDetails PubMed
TargetCalcium/calmodulin-dependent protein kinase type II subunit alpha(Homo sapiens (Human))
University Of Copenhagen
Curated by ChEMBL
LigandPNGBDBM50588629(CHEMBL5170093)
Affinity DataIC50:  4.52E+5nM. Assay description: Binding affinity to recombinant human CaMK2alpha 6x hub domain (345 to 475 residues) Trp403 residue assessed as inhibition of intrinsic tryptophan fl...
In DepthDetails PubMed