BDBM50589556 CHEMBL5207498
SMILES CCCn1c(=O)[nH]c2nc([nH]c2c1=O)-c1ccc(cc1)N=C=S
InChI Key InChIKey=BPJQQDPYIWZQJP-UHFFFAOYSA-N
Data  2 KI
  Tab Delimited (TSV)   2D SDfile   Computed 3D by Vconf -m prep SDfile
Find this compound or compounds like it in BindingDB:
Activity Spreadsheet -- Enzyme Inhibition Constant Data from BindingDB
Found 2 hits for monomerid = 50589556
TargetAdenosine receptor A2b(Homo sapiens (Human))
Leiden University
Curated by ChEMBL
LigandPNGBDBM50589556(CHEMBL5207498)
Affinity DataKi:  0.661nM. Assay description: Displacement of [3H]PSB-603 from human adenosine A2B receptor expressed in CHO cell membrane preincubated for 4 hrs followed by [3H]PSB-603 addition ...
Ligand InfoPC cidPC sid
In DepthDetails PubMed
TargetAdenosine receptor A2b(Homo sapiens (Human))
Leiden University
Curated by ChEMBL
LigandPNGBDBM50589556(CHEMBL5207498)
Affinity DataKi:  2.10nM. Assay description: Displacement of [3H]PSB-603 from human adenosine A2B receptor expressed in CHO cell membrane and measured after 0.5 hrs by radioligand displacement a...
Ligand InfoPC cidPC sid
In DepthDetails PubMed