BDBM50590656 CHEMBL1628565::LY-344864
SMILES CN(C)[C@@H]1CCc2[nH]c3ccc(NC(=O)c4ccc(F)cc4)cc3c2C1
InChI Key InChIKey=GKWHICIUSVVNGX-MRXNPFEDSA-N
Data  8 KI
  Tab Delimited (TSV)   2D SDfile   Computed 3D by Vconf -m prep SDfile
Find this compound or compounds like it in BindingDB:
Activity Spreadsheet -- Enzyme Inhibition Constant Data from BindingDB
Found 8 hits for monomerid = 50590656
Target5-hydroxytryptamine receptor 1F(Homo sapiens (Human))
Beijing Normal University
Curated by ChEMBL
LigandPNGBDBM50590656(CHEMBL1628565 | LY-344864)
Affinity DataKi:  6nM. Assay description: Binding affinity to human 5-HT1F assessed as inhibition constant
In DepthDetails PubMed
Target5-hydroxytryptamine receptor 7(Homo sapiens (Human))
Beijing Normal University
Curated by ChEMBL
LigandPNGBDBM50590656(CHEMBL1628565 | LY-344864)
Affinity DataKi: >500nM. Assay description: Binding affinity to 5-HT7 receptor (unknown origin)
In DepthDetails PubMed
Target5-hydroxytryptamine receptor 5A(Homo sapiens (Human))
Beijing Normal University
Curated by ChEMBL
LigandPNGBDBM50590656(CHEMBL1628565 | LY-344864)
Affinity DataKi: >500nM. Assay description: Binding affinity to 5-HT5A receptor (unknown origin) assessed as inhibition constant
In DepthDetails PubMed
Target5-hydroxytryptamine receptor 1A(Homo sapiens (Human))
Beijing Normal University
Curated by ChEMBL
LigandPNGBDBM50590656(CHEMBL1628565 | LY-344864)
Affinity DataKi: >500nM. Assay description: Binding affinity to 5-HT1A (unknown origin) assessed as inhibition constant
In DepthDetails PubMed
Target5-hydroxytryptamine receptor 1B(Homo sapiens (Human))
Beijing Normal University
Curated by ChEMBL
LigandPNGBDBM50590656(CHEMBL1628565 | LY-344864)
Affinity DataKi: >500nM. Assay description: Binding affinity to 5-HT1B (unknown origin) assessed as inhibition constant
In DepthDetails PubMed
Target5-hydroxytryptamine receptor 1D(Homo sapiens (Human))
Beijing Normal University
Curated by ChEMBL
LigandPNGBDBM50590656(CHEMBL1628565 | LY-344864)
Affinity DataKi: >500nM. Assay description: Binding affinity to 5-HT1D (unknown origin) assessed as inhibition constant
In DepthDetails PubMed
Target5-hydroxytryptamine receptor 2C(Homo sapiens (Human))
Beijing Normal University
Curated by ChEMBL
LigandPNGBDBM50590656(CHEMBL1628565 | LY-344864)
Affinity DataKi: >500nM. Assay description: Binding affinity to 5-HT2C (unknown origin) assessed as inhibition constant
In DepthDetails PubMed
Target5-hydroxytryptamine receptor 2B(Homo sapiens (Human))
Beijing Normal University
Curated by ChEMBL
LigandPNGBDBM50590656(CHEMBL1628565 | LY-344864)
Affinity DataKi: >500nM. Assay description: Binding affinity to 5-HT2B (unknown origin) assessed as inhibition constant
In DepthDetails PubMed