BDBM50591370 CHEMBL5185774
SMILES Cc1ccc(C)c(c1)C1NC(=O)c2c(Cl)cccc2N1
InChI Key InChIKey=ACSIKXIGGISTLO-UHFFFAOYSA-N
Data  1 IC50
  Tab Delimited (TSV)   2D SDfile   Computed 3D by Vconf -m prep SDfile
Find this compound or compounds like it in BindingDB:
Activity Spreadsheet -- Enzyme Inhibition Constant Data from BindingDB
Found 1 hit for monomerid = 50591370
TargetProtein polybromo-1(Homo sapiens (Human))
Medical College Of Wisconsin
Curated by ChEMBL
LigandPNGBDBM50591370(CHEMBL5185774)
Affinity DataIC50:  430nM. Assay description: Inhibition of biotinylated histone H3K14 (1 to 20 residues) peptide binding to His6-tagged recombinant human PBRM1 BD2 transfected in Escherichia col...
Ligand InfoPC cidPC sid
In DepthDetails PubMed