BDBM50591456 CHEMBL5207130
SMILES CCc1ccc(cc1)-c1nc2cc(NC(=O)c3cc(ccc3Cl)[N+]([O-])=O)ccc2o1
InChI Key InChIKey=WFEBALYYDASKIV-UHFFFAOYSA-N
Data  12 IC50  1 EC50
  Tab Delimited (TSV)   2D SDfile   Computed 3D by Vconf -m prep SDfile
Find this compound or compounds like it in BindingDB:
Activity Spreadsheet -- Enzyme Inhibition Constant Data from BindingDB
Found 13 hits for monomerid = 50591456
TargetPeroxisome proliferator-activated receptor gamma(Homo sapiens (Human))
Broad Institute Of Mit And Harvard
Curated by ChEMBL
LigandPNGBDBM50591456(CHEMBL5207130)
Affinity DataEC50:  5.80nM. Assay description: Inverse agonist activity at PPARgamma LBD (unknown origin) assessed as recruitment of corepressor NCOR2 to PPARgamma LBD by LanthaScreen TR-FRET assa...
In DepthDetails PubMed
TargetPeroxisome proliferator-activated receptor gamma(Homo sapiens (Human))
Broad Institute Of Mit And Harvard
Curated by ChEMBL
LigandPNGBDBM50591456(CHEMBL5207130)
Affinity DataIC50:  0.170nM. Assay description: Inverse agonist activity at PPARgamma in human RT112/84-FABP4 cells assessed as reduction in PPARgamma transactivation measured by Nanoluciferase rep...
In DepthDetails PubMed
TargetPeroxisome proliferator-activated receptor gamma(Mus musculus)
Broad Institute Of Mit And Harvard
Curated by ChEMBL
LigandPNGBDBM50591456(CHEMBL5207130)
Affinity DataIC50:  0.140nM. Assay description: Inverse agonist activity at GAL4-tagged mouse PPARgamma LBD expressed in CHO cells measured after 6 hrs by firefly luciferase reporter assay
In DepthDetails PubMed
TargetPeroxisome proliferator-activated receptor gamma(Homo sapiens (Human))
Broad Institute Of Mit And Harvard
Curated by ChEMBL
LigandPNGBDBM50591456(CHEMBL5207130)
Affinity DataIC50:  0.400nM. Assay description: Inverse agonist activity at GAL4-tagged human PPARgamma LBD expressed in CHO cells measured after 6 hrs by firefly luciferase reporter assay
In DepthDetails PubMed
TargetPeroxisome proliferator-activated receptor alpha(Homo sapiens (Human))
Broad Institute Of Mit And Harvard
Curated by ChEMBL
LigandPNGBDBM50591456(CHEMBL5207130)
Affinity DataIC50: >5.00E+4nM. Assay description: Inverse agonist activity at GAL4-tagged human PPARalpha LBD expressed in CHO cells measured after 6 hrs by firefly luciferase reporter assay
In DepthDetails PubMed
TargetPeroxisome proliferator-activated receptor delta(Homo sapiens (Human))
Broad Institute Of Mit And Harvard
Curated by ChEMBL
LigandPNGBDBM50591456(CHEMBL5207130)
Affinity DataIC50: >5.00E+4nM. Assay description: Inverse agonist activity at GAL4-tagged human PPARdelta LBD expressed in CHO cells measured after 6 hrs by firefly luciferase reporter assay
In DepthDetails PubMed
TargetPeroxisome proliferator-activated receptor gamma(Mus musculus)
Broad Institute Of Mit And Harvard
Curated by ChEMBL
LigandPNGBDBM50591456(CHEMBL5207130)
Affinity DataIC50:  148nM. Assay description: Inverse agonist activity at PPARgamma in mouse 3T3-L1 adipocytes assessed as inhibition of adipogenesis by measuring lipid droplet staining by BODIPY...
In DepthDetails PubMed
TargetCytochrome P450 2C8(Homo sapiens (Human))
Broad Institute Of Mit And Harvard
Curated by ChEMBL
LigandPNGBDBM50591456(CHEMBL5207130)
Affinity DataIC50:  7.00E+3nM. Assay description: Inhibition of CYP2C8 in human liver microsomes using amodiaquine as substrate by LC-MS/MS analysis
In DepthDetails PubMed
TargetCytochrome P450 2C9(Homo sapiens (Human))
Broad Institute Of Mit And Harvard
Curated by ChEMBL
LigandPNGBDBM50591456(CHEMBL5207130)
Affinity DataIC50: >1.00E+4nM. Assay description: Inhibition of CYP2C9 in human liver microsomes using diclofenac as substrate by LC-MS/MS analysis
In DepthDetails PubMed
TargetCytochrome P450 2D6(Homo sapiens (Human))
Broad Institute Of Mit And Harvard
Curated by ChEMBL
LigandPNGBDBM50591456(CHEMBL5207130)
Affinity DataIC50: >1.00E+4nM. Assay description: Inhibition of CYP2D6 in human liver microsomes using dextromethorphan as substrate by LC-MS/MS analysis
In DepthDetails PubMed
TargetCytochrome P450 3A4(Homo sapiens (Human))
Broad Institute Of Mit And Harvard
Curated by ChEMBL
LigandPNGBDBM50591456(CHEMBL5207130)
Affinity DataIC50: >1.00E+4nM. Assay description: Inhibition of CYP3A4 in human liver microsomes using midazolam as substrate by LC-MS/MS analysis
In DepthDetails PubMed
TargetNuclear receptor subfamily 1 group I member 2(Homo sapiens (Human))
Broad Institute Of Mit And Harvard
Curated by ChEMBL
LigandPNGBDBM50591456(CHEMBL5207130)
Affinity DataIC50: >5.00E+4nM. Assay description: Inverse agonist activity at human PXR expressed in HepG2 cells measured by One-Glo luciferase assay
In DepthDetails PubMed
TargetCytochrome P450 1A2(Homo sapiens (Human))
Broad Institute Of Mit And Harvard
Curated by ChEMBL
LigandPNGBDBM50591456(CHEMBL5207130)
Affinity DataIC50: >1.00E+4nM. Assay description: Inhibition of CYP1A2 in human liver microsomes using phenacetin as substrate by LC-MS/MS analysis
In DepthDetails PubMed