BDBM50591478 CHEMBL5206276
SMILES CCc1ccc(cc1)-c1nc2cc(NC(=O)c3cc(ccc3F)[N+]([O-])=O)ccc2o1
InChI Key InChIKey=IKSFQSJTWNYRSZ-UHFFFAOYSA-N
Data  1 IC50  1 EC50
  Tab Delimited (TSV)   2D SDfile   Computed 3D by Vconf -m prep SDfile
Find this compound or compounds like it in BindingDB:
Activity Spreadsheet -- Enzyme Inhibition Constant Data from BindingDB
Found 2 hits for monomerid = 50591478
TargetPeroxisome proliferator-activated receptor gamma(Homo sapiens (Human))
Broad Institute Of Mit And Harvard
Curated by ChEMBL
LigandPNGBDBM50591478(CHEMBL5206276)
Affinity DataIC50:  4nM. Assay description: Inverse agonist activity at PPARgamma in human RT112/84-FABP4 cells assessed as reduction in PPARgamma transactivation measured by Nanoluciferase rep...
Ligand InfoPC cidPC sid
In DepthDetails PubMed
TargetPeroxisome proliferator-activated receptor gamma(Homo sapiens (Human))
Broad Institute Of Mit And Harvard
Curated by ChEMBL
LigandPNGBDBM50591478(CHEMBL5206276)
Affinity DataEC50:  3.30nM. Assay description: Inverse agonist activity at PPARgamma LBD (unknown origin) assessed as recruitment of corepressor NCOR2 to PPARgamma LBD by LanthaScreen TR-FRET assa...
Ligand InfoPC cidPC sid
In DepthDetails PubMed