BDBM50591816 CHEMBL5187971
SMILES COc1ccc(Cn2c(C(O)=O)c(CNCc3ccc(O)c(OC)c3)c3ccccc23)cc1
InChI Key InChIKey=NJCFZUDCWFOMDV-UHFFFAOYSA-N
Data  1 Kd
  Tab Delimited (TSV)   2D SDfile   Computed 3D by Vconf -m prep SDfile
Find this compound or compounds like it in BindingDB:
Activity Spreadsheet -- Enzyme Inhibition Constant Data from BindingDB
Found 1 hit for monomerid = 50591816
Target14-3-3 protein eta(Homo sapiens (Human))
Tsinghua University
Curated by ChEMBL
LigandPNGBDBM50591816(CHEMBL5187971)
Affinity DataKd:  1.40E+5nM. Assay description: Binding affinity to 14-3-3 eta (unknown origin) assessed as dissociation constant by biolayer interferometry assay
Ligand InfoPC cidPC sid
In DepthDetails PubMed