BDBM50591823 CHEMBL5203713
SMILES COc1cccc(CNCc2c(C(O)=O)n(Cc3ccccc3F)c3cc(ccc23)C(C)C)c1
InChI Key InChIKey=QKMZILGPZYBGFZ-UHFFFAOYSA-N
Data  1 Kd
  Tab Delimited (TSV)   2D SDfile   Computed 3D by Vconf -m prep SDfile
Find this compound or compounds like it in BindingDB:
Activity Spreadsheet -- Enzyme Inhibition Constant Data from BindingDB
Found 1 hit for monomerid = 50591823
Target14-3-3 protein eta(Homo sapiens (Human))
Tsinghua University
Curated by ChEMBL
LigandPNGBDBM50591823(CHEMBL5203713)
Affinity DataKd:  3.70E+4nM. Assay description: Binding affinity to 14-3-3 eta (unknown origin) assessed as dissociation constant by biolayer interferometry assay
Ligand InfoPC cidPC sid
In DepthDetails PubMed