BDBM50595516 CHEMBL5197857
SMILES COc1ccc(-c2cn3ccc(cc3n2)N2CCNCC2)c(OCCCN2CCOCC2)c1
InChI Key InChIKey=VTIWHGTZOGUJDM-UHFFFAOYSA-N
Data  2 IC50
  Tab Delimited (TSV)   2D SDfile   Computed 3D by Vconf -m prep SDfile
Find this compound or compounds like it in BindingDB:
Activity Spreadsheet -- Enzyme Inhibition Constant Data from BindingDB
Found 2 hits for monomerid = 50595516
TargetToll-like receptor 7(Homo sapiens (Human))
Csir-Indian Institute Of Chemical Biology
Curated by ChEMBL
LigandPNGBDBM50595516(CHEMBL5197857)
Affinity DataIC50:  1.35E+3nM. Assay description: Antagonist activity at human TLR7 expressed in HEK-blue hTLR7 cells assessed as inhibition of CL264-induced NFkappaB activation preincubated with com...
Ligand InfoPC cidPC sid
In DepthDetails PubMed
TargetToll-like receptor 9(Homo sapiens (Human))
Csir-Indian Institute Of Chemical Biology
Curated by ChEMBL
LigandPNGBDBM50595516(CHEMBL5197857)
Affinity DataIC50:  35nM. Assay description: Antagonist activity at human TLR9 expressed in HEK-blue hTLR9 cells assessed as inhibition of CpGB-induced NFkappaB activation preincubated with comp...
Ligand InfoPC cidPC sid
In DepthDetails PubMed