BDBM50596165 CHEMBL5202816
SMILES Fc1cncc(c1)-n1ccc(NC(=O)C2(CC2)c2ccccc2Cl)n1
InChI Key InChIKey=PHVLYQPOUMEORO-UHFFFAOYSA-N
Data  2 IC50
  Tab Delimited (TSV)   2D SDfile   Computed 3D by Vconf -m prep SDfile
Find this compound or compounds like it in BindingDB:
Activity Spreadsheet -- Enzyme Inhibition Constant Data from BindingDB
Found 2 hits for monomerid = 50596165
TargetElongation of very long chain fatty acids protein 1(Homo sapiens (Human))
Vertex Pharmaceuticals
Curated by ChEMBL
LigandPNGBDBM50596165(CHEMBL5202816)
Affinity DataIC50:  110nM. Assay description: Inhibition of ELOVL1 in human HEK2936E cells assessed as reduction of C26:0 LPC synthesis incubated for 48 hrs by cellular assay
Ligand InfoPC cidPC sid
In DepthDetails PubMed
TargetElongation of very long chain fatty acids protein 1(Homo sapiens (Human))
Vertex Pharmaceuticals
Curated by ChEMBL
LigandPNGBDBM50596165(CHEMBL5202816)
Affinity DataIC50:  4.50E+3nM. Assay description: Inhibition of ELOVL1 (unknown origin) using C22-acyl-CoA as substrate by radiometric enzyme assay
Ligand InfoPC cidPC sid
In DepthDetails PubMed