BDBM50597204 CHEMBL5196841
SMILES Cl.Cl.COc1ccc2[C@@H](C)N(CCc2c1-c1cc(F)c(O)c(NCC(C)C)c1)C(C)c1ccc(cc1)C(C)C
InChI Key InChIKey=DYJPKCQEUFZMQC-POQFIVKRSA-N
Data  1 EC50
  Tab Delimited (TSV)   2D SDfile   Computed 3D by Vconf -m prep SDfile
Find this compound or compounds like it in BindingDB:
Activity Spreadsheet -- Enzyme Inhibition Constant Data from BindingDB
Found 1 hit for monomerid = 50597204
TargetGastric inhibitory polypeptide receptor(Homo sapiens (Human))
Smith, Gambrell & Russell
Curated by ChEMBL
LigandPNGBDBM50597204(CHEMBL5196841)
Affinity DataEC50:  12nM. Assay description: Positive allosteric modulator activity at human GIPR expressed in HEK293 cells assessed as potentiation of intracellular cAMP accumulation incubated ...
Ligand InfoPC cidPC sid
In DepthDetails PubMed