BDBM50597987 CHEMBL5170853
SMILES O=C(\C=C\C=C\c1ccco1)/C=C/C=C/c1ccco1
InChI Key InChIKey=JHGFEQGWJVCBOX-BWZMWZRISA-N
Data  1 IC50
  Tab Delimited (TSV)   2D SDfile   Computed 3D by Vconf -m prep SDfile
Find this compound or compounds like it in BindingDB:
Activity Spreadsheet -- Enzyme Inhibition Constant Data from BindingDB
Found 1 hit for monomerid = 50597987
TargetTriosephosphate isomerase, glycosomal(Trypanosoma cruzi)
Universidad De Navarra
Curated by ChEMBL
LigandPNGBDBM50597987(CHEMBL5170853)
Affinity DataIC50:  3.00E+3nM. Assay description: Inhibition of Trypanosoma cruzi TIM
Ligand InfoPC cidPC sid
In DepthDetails PubMed