BDBM50597991 CHEMBL5198783
SMILES [#8-]-[#7+](=O)-c1ccc(\[#6]=[#6]-2/[#6](=O)-[#7](-[#6]-c3ccccc3)S(=O)(=O)[#7](-[#6]-c3ccccc3)-[#6]-2=O)o1
InChI Key InChIKey=IAFAANQPDPWPHK-UHFFFAOYSA-N
Data  1 IC50
  Tab Delimited (TSV)   2D SDfile   Computed 3D by Vconf -m prep SDfile
Find this compound or compounds like it in BindingDB:
Activity Spreadsheet -- Enzyme Inhibition Constant Data from BindingDB
Found 1 hit for monomerid = 50597991
TargetTriosephosphate isomerase, glycosomal(Trypanosoma cruzi)
Universidad De Navarra
Curated by ChEMBL
LigandPNGBDBM50597991(CHEMBL5198783)
Affinity DataIC50:  1.30E+4nM. Assay description: Inhibition of Trypanosoma cruzi TIM expressed in Escherichia coli using glyceraldehyde 3-phosphate as substrate preincubated for 2 hrs in presence of...
Ligand InfoPC cidPC sid
In DepthDetails PubMed