BDBM50597993 ANETHOLTRITHION::Anethole Trithione::Anethole trithione::Anetholtrithion::OP-2113::OP2113
SMILES COc1ccc(cc1)-c1cc(=S)ss1
InChI Key InChIKey=KYLIZBIRMBGUOP-UHFFFAOYSA-N
Data  1 IC50
  Tab Delimited (TSV)   2D SDfile   Computed 3D by Vconf -m prep SDfile
Find this compound or compounds like it in BindingDB:
Activity Spreadsheet -- Enzyme Inhibition Constant Data from BindingDB
Found 1 hit for monomerid = 50597993
TargetTriosephosphate isomerase, glycosomal(Trypanosoma cruzi)
Universidad De Navarra
Curated by ChEMBL
LigandPNGBDBM50597993(ANETHOLTRITHION | Anethole Trithione | Anethole tr...)
Affinity DataIC50:  1.20E+3nM. Assay description: Inhibition of Trypanosoma cruzi TIM expressed in Escherichia coli using glyceraldehyde 3-phosphate as substrate in presence of NADH/alphaGDPH measure...
In DepthDetails PubMed