BDBM50598293 CHEMBL5172075
SMILES CC[C@H](C)[C@@H]1NC(=O)[C@H](CSCC(=O)CSC[C@H](NC(=O)[C@H](Cc2ccccc2)NC(=O)[C@H](CCC(N)=O)NC(=O)[C@H](Cc2ccc(O)cc2)NC(=O)N[C@H](NC(=O)[C@@H](NC1=O)[C@@H](C)CC)[C@@H](C)O)C(=O)N[C@@H]([C@H](C)O)C(=O)N[C@@H](Cc1c[nH]cn1)C(=O)N[C@@H](CC(O)=O)C(=O)N[C@@H](CCCNC(N)=N)C(=O)N[C@@H](Cc1ccc(O)cc1)C(=O)NCC(=O)N[C@H]1CSCC(=O)CSC[C@H](NC1=O)C(=O)N[C@@H](CO)C(O)=O)NC(=O)[C@@H](N)CCC(N)=O
InChI Key InChIKey=DAXWCTVQRNGDRW-QNEXPHIMSA-N
Data  1 KI
  Tab Delimited (TSV)   2D SDfile   Computed 3D by Vconf -m prep SDfile
Find this compound or compounds like it in BindingDB:
Activity Spreadsheet -- Enzyme Inhibition Constant Data from BindingDB
Found 1 hit for monomerid = 50598293
TargetKallikrein-7(Homo sapiens (Human))
Ecole Polytechnique F�D�Rale De Lausanne (Epfl)
Curated by ChEMBL
LigandPNGBDBM50598293(CHEMBL5172075)
Affinity DataKi:  96nM. Assay description: Inhibition of C-terminal poly-His-tagged human recombinant KLK7 (30 to 253 residues) transfected in CHO cells assessed as inhibition constant using K...
Ligand InfoPC cidPC sid
In DepthDetails PubMed