BDBM50598298 CHEMBL5206546
SMILES CC(C)C[C@@H]1NC(=O)[C@H](CSCc2cccc(CSC[C@H](NC(=O)[C@H](CO)NC(=O)[C@H](CC(C)C)NC(=O)[C@H](Cc3ccccc3)NC1=O)C(=O)N[C@@H](CO)C(O)=O)n2)NC(=O)[C@@H]1CCCN1
InChI Key InChIKey=LHDULLZLPKIFOF-MDKUUQCZSA-N
Data  1 KI
  Tab Delimited (TSV)   2D SDfile   Computed 3D by Vconf -m prep SDfile
Find this compound or compounds like it in BindingDB:
Activity Spreadsheet -- Enzyme Inhibition Constant Data from BindingDB
Found 1 hit for monomerid = 50598298
TargetKallikrein-7(Homo sapiens (Human))
Ecole Polytechnique F�D�Rale De Lausanne (Epfl)
Curated by ChEMBL
LigandPNGBDBM50598298(CHEMBL5206546)
Affinity DataKi:  220nM. Assay description: Inhibition of C-terminal poly-His-tagged human recombinant KLK7 (30 to 253 residues) transfected in CHO cells assessed as inhibition constant using K...
Ligand InfoPC cidPC sid
In DepthDetails PubMed