BDBM50598307 CHEMBL5177530
SMILES CC(C)C[C@@H]1NC(=O)[C@H](CSCC(=O)CSC[C@H](NC(=O)[C@H](CCC(N)=O)NC(=O)[C@H](C)NC(=O)[C@H](CC(C)C)NC(=O)[C@H](Cc2ccc(O)cc2)NC1=O)C(=O)N[C@@H](CO)C(O)=O)NC(=O)[C@@H]1CCCN1
InChI Key InChIKey=MLSGNBASYVMMIP-MNUSCXAMSA-N
Data  1 KI
  Tab Delimited (TSV)   2D SDfile   Computed 3D by Vconf -m prep SDfile
Find this compound or compounds like it in BindingDB:
Activity Spreadsheet -- Enzyme Inhibition Constant Data from BindingDB
Found 1 hit for monomerid = 50598307
TargetKallikrein-7(Homo sapiens (Human))
Ecole Polytechnique F�D�Rale De Lausanne (Epfl)
Curated by ChEMBL
LigandPNGBDBM50598307(CHEMBL5177530)
Affinity DataKi:  36nM. Assay description: Inhibition of C-terminal poly-His-tagged human recombinant KLK7 (30 to 253 residues) transfected in CHO cells assessed as inhibition constant using K...
Ligand InfoPC cidPC sid
In DepthDetails PubMed