BDBM50601485 CHEMBL5206633
SMILES NS(=O)(=O)OC[C@@H]1C[C@H](C[C@@H]1O)n1nnc2c(NCCc3ccccc3)ncnc12
InChI Key InChIKey=FRVKNLCUOXIYII-ZNMIVQPWSA-N
Data  1 IC50
  Tab Delimited (TSV)   2D SDfile   Computed 3D by Vconf -m prep SDfile
Find this compound or compounds like it in BindingDB:
Activity Spreadsheet -- Enzyme Inhibition Constant Data from BindingDB
Found 1 hit for monomerid = 50601485
TargetNEDD8-activating enzyme E1 catalytic subunit(Homo sapiens)
Shanghai Institute Of Materia Medica (Simm)
Curated by ChEMBL
LigandPNGBDBM50601485(CHEMBL5206633)
Affinity DataIC50:  82nM. Assay description: Inhibition of NAE (unknown origin) mediated neddylation assessed as decrease in NEDD8-Ubcl2 adduct formation incubated for 2 hrs in presence of L-glu...
Ligand InfoPC cidPC sid
In DepthDetails PubMed