BDBM50601497 CHEMBL5173277
SMILES COCC(=O)N[C@H]1Cc2ccccc2[C@H]1Nc1ncnc2n(nnc12)[C@H]1C[C@H](O)[C@H](COS(N)(=O)=O)C1
InChI Key InChIKey=UHZSMEDUPPKHQT-KQRABZDBSA-N
Data  1 IC50
  Tab Delimited (TSV)   2D SDfile   Computed 3D by Vconf -m prep SDfile
Find this compound or compounds like it in BindingDB:
Activity Spreadsheet -- Enzyme Inhibition Constant Data from BindingDB
Found 1 hit for monomerid = 50601497
TargetNEDD8-activating enzyme E1 catalytic subunit(Homo sapiens)
Shanghai Institute Of Materia Medica (Simm)
Curated by ChEMBL
LigandPNGBDBM50601497(CHEMBL5173277)
Affinity DataIC50:  170nM. Assay description: Inhibition of NAE (unknown origin) mediated neddylation assessed as decrease in NEDD8-Ubcl2 adduct formation incubated for 2 hrs in presence of L-glu...
Ligand InfoPC cidPC sid
In DepthDetails PubMed