BDBM50601504 CHEMBL5179467
SMILES NS(=O)(=O)OC[C@@H]1C[C@H](C[C@@H]1O)n1nnc2c(N[C@H]3CC4(CCN(CC4)C(=O)OC(C(F)(F)F)C(F)(F)F)c4ccccc34)ncnc12
InChI Key InChIKey=NSRYFRUKRQLHSU-QXGSTGNESA-N
Data  1 IC50
  Tab Delimited (TSV)   2D SDfile   Computed 3D by Vconf -m prep SDfile
Find this compound or compounds like it in BindingDB:
Activity Spreadsheet -- Enzyme Inhibition Constant Data from BindingDB
Found 1 hit for monomerid = 50601504
TargetNEDD8-activating enzyme E1 catalytic subunit(Homo sapiens)
Shanghai Institute Of Materia Medica (Simm)
Curated by ChEMBL
LigandPNGBDBM50601504(CHEMBL5179467)
Affinity DataIC50:  21nM. Assay description: Inhibition of NAE (unknown origin) mediated neddylation assessed as decrease in NEDD8-Ubcl2 adduct formation incubated for 2 hrs in presence of L-glu...
Ligand InfoPC cidPC sid
In DepthDetails PubMed