BDBM50601702 CHEMBL5199257
SMILES CC(C)(C)[C@H](NC(=O)[C@H](CCCNC(N)=N)NC(=O)Cc1ccc(CNC(N)=N)cc1)C(=O)N[C@@H](CCCNC(N)=N)C(=O)NCc1ccc(N)nc1
InChI Key InChIKey=SAJVHOUNSZYRAG-NLJOTIRTSA-N
Data  1 KI  1 IC50
  Tab Delimited (TSV)   2D SDfile   Computed 3D by Vconf -m prep SDfile
Find this compound or compounds like it in BindingDB:
Activity Spreadsheet -- Enzyme Inhibition Constant Data from BindingDB
Found 2 hits for monomerid = 50601702
TargetFurin(Homo sapiens (Human))
University Of Michigan
Curated by ChEMBL
LigandPNGBDBM50601702(CHEMBL5199257)
Affinity DataKi:  0.800nM. Assay description: Inhibition of furin (unknown origin)
Ligand InfoPC cidPC sid
In DepthDetails PubMed
TargetFurin(Homo sapiens (Human))
University Of Michigan
Curated by ChEMBL
LigandPNGBDBM50601702(CHEMBL5199257)
Affinity DataIC50:  3nM. Assay description: Inhibition of furin (unknown origin)
Ligand InfoPC cidPC sid
In DepthDetails PubMed