BDBM50601722 CHEMBL5176040
SMILES CC(C)[C@H](NC(=O)[C@H](CCCNC(N)=N)NC(=O)[C@H](CCCNC(N)=N)NC(=O)[C@@H](N)CCCNC(N)=N)C(=O)N[C@@H](CCCNC(N)=N)C(=O)NCc1ccc(cc1)C(N)=N
InChI Key InChIKey=OZKNFFVLIBJPPM-IRGGMKSGSA-N
Data  1 KI
  Tab Delimited (TSV)   2D SDfile   Computed 3D by Vconf -m prep SDfile
Find this compound or compounds like it in BindingDB:
Activity Spreadsheet -- Enzyme Inhibition Constant Data from BindingDB
Found 1 hit for monomerid = 50601722
TargetFurin(Homo sapiens (Human))
University Of Michigan
Curated by ChEMBL
LigandPNGBDBM50601722(CHEMBL5176040)
Affinity DataKi:  0.0340nM. Assay description: Inhibition of recombinant human furin using Phac-Arg-Val-Arg-Arg-AMC as substrate incubated for 30 mins and measured by microplate reader method
Ligand InfoPC cidPC sid
In DepthDetails PubMed