BDBM50601893 DIHYDROBETULIN::Dihydrobetulin
SMILES [H][C@]12[C@@H](CC[C@]1(CO)CC[C@]1(C)[C@]2([H])CC[C@]2([H])[C@@]3(C)CC[C@H](O)C(C)(C)[C@]3([H])CC[C@@]12C)C(C)C
InChI Key InChIKey=JZZMDHQYBFQRMW-ROUWMTJPSA-N
Data  1 IC50
  Tab Delimited (TSV)   2D SDfile   Computed 3D by Vconf -m prep SDfile
Find this compound or compounds like it in BindingDB:
Activity Spreadsheet -- Enzyme Inhibition Constant Data from BindingDB
Found 1 hit for monomerid = 50601893
TargetSodium/bile acid cotransporter(Homo sapiens (Human))
Southwest Jiaotong University
Curated by ChEMBL
LigandPNGBDBM50601893(DIHYDROBETULIN | Dihydrobetulin)
Affinity DataIC50:  4.00E+3nM. Assay description: Inhibition of HBV subgenotype D3 [3H]-myr-preS1 (2 to 48 residues) peptide binding to human NTCP in HEK293 cells preincubated for 5 mins followed by ...
Ligand InfoPC cidPC sid
In DepthDetails PubMed