BDBM50602108 CHEMBL5182459
SMILES Cc1ccc(cc1)C(=O)Nc1cc(nn1Cc1cc(F)c(F)c(F)c1)C(O)=O
InChI Key InChIKey=ZYYFTSVEOBYSQW-UHFFFAOYSA-N
Data  1 IC50
  Tab Delimited (TSV)   2D SDfile   Computed 3D by Vconf -m prep SDfile
Find this compound or compounds like it in BindingDB:
Activity Spreadsheet -- Enzyme Inhibition Constant Data from BindingDB
Found 1 hit for monomerid = 50602108
TargetP2Y purinoceptor 14(Homo sapiens (Human))
China Pharmaceutical University
Curated by ChEMBL
LigandPNGBDBM50602108(CHEMBL5182459)
Affinity DataIC50:  4nM. Assay description: Antagonist activity at P2Y14R (unknown origin) expressed in HEK293 cells assessed as inhibition of forskolin-stimulated cAMP accumulation incubated i...
Ligand InfoPC cidPC sid
In DepthDetails PubMed