BDBM50602795 CHEMBL5204459
SMILES COc1ccc2cc(ccc2c1)C(=O)Nc1ccc(C)c(c1)C(=O)Nc1cnc(Nc2cccc(N)c2)nc1
InChI Key InChIKey=YEVYGRCYEKDRGH-UHFFFAOYSA-N
Data  2 IC50
  Tab Delimited (TSV)   2D SDfile   Computed 3D by Vconf -m prep SDfile
Find this compound or compounds like it in BindingDB:
Activity Spreadsheet -- Enzyme Inhibition Constant Data from BindingDB
Found 2 hits for monomerid = 50602795
TargetTyrosine-protein kinase BTK(Homo sapiens (Human))
Peking University
Curated by ChEMBL
LigandPNGBDBM50602795(CHEMBL5204459)
Affinity DataIC50:  64nM. Assay description: Inhibition of wild type N-terminal GST tagged BTK (unknown origin) (2 to 659 residues) expressed in sf21 insect cell using TK as substrate incubated ...
Ligand InfoPC cidPC sid
In DepthDetails PubMed
TargetTyrosine-protein kinase Blk(Homo sapiens (Human))
Peking University
Curated by ChEMBL
LigandPNGBDBM50602795(CHEMBL5204459)
Affinity DataIC50:  6.10nM. Assay description: Inhibition of wild type N-terminal GST tagged BLK (unknown origin) (1 to 505 residues) expressed in sf21 insect cell using TK as substrate incubated ...
Ligand InfoPC cidPC sid
In DepthDetails PubMed