BDBM50603458 CHEMBL5196275
SMILES CCCCCCCCCCCCCCCC(=O)N[C@@H](Cc1c[nH]c2ccccc12)C(=O)N[C@@H](Cc1ccc(O)cc1)C(=O)N[C@@H](CCCCN)C(=O)NCCCCC(=O)NCCCCC(=O)NCCCCC(=O)NCC(=O)N[C@@H](CCCNC(N)=N)C(=O)N[C@@H](C)C(=O)N[C@@H](C)C(=O)NCC(=O)N[C@@H](CC(C)C)C(=O)N[C@@H](CC(C)C)C(N)=O
InChI Key InChIKey=BRJKSKHPYACAGN-ZVIIWVDQSA-N
Data  1 IC50  1 EC50
  Tab Delimited (TSV)   2D SDfile   Computed 3D by Vconf -m prep SDfile
Find this compound or compounds like it in BindingDB:
Activity Spreadsheet -- Enzyme Inhibition Constant Data from BindingDB
Found 2 hits for monomerid = 50603458
TargetNeuropeptides B/W receptor type 1(Homo sapiens (Human))
Rti International
Curated by ChEMBL
LigandPNGBDBM50603458(CHEMBL5196275)
Affinity DataIC50:  71nM. Assay description: Antagonist activity at human NPBWR1 expressed in CHO-RD-HGA16 cells measured by calcium mobilization assay
Ligand InfoPC cidPC sid
In DepthDetails PubMed
TargetNeuropeptides B/W receptor type 1(Homo sapiens (Human))
Rti International
Curated by ChEMBL
LigandPNGBDBM50603458(CHEMBL5196275)
Affinity DataEC50: >1.00E+4nM. Assay description: Agonist activity at human NPBWR1 expressed in CHO-RD-HGA16 cells measured by calcium mobilization assay
Ligand InfoPC cidPC sid
In DepthDetails PubMed