BDBM50604404 CHEMBL5186857
SMILES CCCCN(CCC1CCCCCC1)CCc1c[nH]c2c(O)cccc12
InChI Key InChIKey=OCHGFFIEJDIPAT-UHFFFAOYSA-N
Data  2 KI  1 IC50
  Tab Delimited (TSV)   2D SDfile   Computed 3D by Vconf -m prep SDfile
Find this compound or compounds like it in BindingDB:
Activity Spreadsheet -- Enzyme Inhibition Constant Data from BindingDB
Found 3 hits for monomerid = 50604404
TargetCholinesterase(Homo sapiens (Human))
University Of Ljubljana
Curated by ChEMBL
LigandPNGBDBM50604404(CHEMBL5186857)
Affinity DataKi:  3nM. Assay description: Binding affinity to human recombinant BChE in enzyme-inhibitor complex
Ligand InfoPC cidPC sid
In DepthDetails PubMed
TargetCholinesterase(Homo sapiens (Human))
University Of Ljubljana
Curated by ChEMBL
LigandPNGBDBM50604404(CHEMBL5186857)
Affinity DataKi:  6.80nM. Assay description: Binding affinity to human recombinant BChE in enzyme-substrate-inhibitor complex
Ligand InfoPC cidPC sid
In DepthDetails PubMed
TargetCholinesterase(Homo sapiens (Human))
University Of Ljubljana
Curated by ChEMBL
LigandPNGBDBM50604404(CHEMBL5186857)
Affinity DataIC50:  28nM. Assay description: Inhibition of recombinant human BChE using butyrylthiocholine iodide as substrate preincubated for 1 to 30 mins followed by substrate addition by Ell...
Ligand InfoPC cidPC sid
In DepthDetails PubMed