BDBM50605030 CHEMBL5209131
SMILES COC1CCN(CC1)c1nc2ccccc2c2n(Cc3cccc(Cl)c3)ccc12
InChI Key InChIKey=FWWGKRMRSGIELS-UHFFFAOYSA-N
Data  1 KI  1 IC50
  Tab Delimited (TSV)   2D SDfile   Computed 3D by Vconf -m prep SDfile
Find this compound or compounds like it in BindingDB:
Activity Spreadsheet -- Enzyme Inhibition Constant Data from BindingDB
Found 2 hits for monomerid = 50605030
Target5-hydroxytryptamine receptor 6(Homo sapiens (Human))
Jagiellonian University Medical College
Curated by ChEMBL
LigandPNGBDBM50605030(CHEMBL5209131)
Affinity DataKi:  799nM. Assay description: Displacement of [3H]-LSD from human 5-HT6R stably expressed in HEK293 cells by radioligand binding assay
Ligand InfoPC cidPC sid
In DepthDetails PubMed
TargetAmine oxidase [flavin-containing] B(Homo sapiens (Human))
Jagiellonian University Medical College
Curated by ChEMBL
LigandPNGBDBM50605030(CHEMBL5209131)
Affinity DataIC50:  0.800nM. Assay description: Inhibition of human recombinant MAO-B using p-tyramine as substrate preincubated for 30 mins followed by substrate addition and measured after 1 hr b...
Ligand InfoPC cidPC sid
In DepthDetails PubMed