BDBM50605149 CHEMBL5200927
SMILES [I-].CN(C)c1ccc(\C=C\c2cc(N3CCCCC3)c3ccccc3[n+]2C)cc1
InChI Key InChIKey=KFWZCKIYOHMHTK-UHFFFAOYSA-M
Data  1 Kd
  Tab Delimited (TSV)   2D SDfile   Computed 3D by Vconf -m prep SDfile
Find this compound or compounds like it in BindingDB:
Activity Spreadsheet -- Enzyme Inhibition Constant Data from BindingDB
Found 1 hit for monomerid = 50605149
TargetCell division protein FtsZ(Staphylococcus aureus)
Guangdong University Of Technology
Curated by ChEMBL
LigandPNGBDBM50605149(CHEMBL5200927)
Affinity DataKd:  2.49E+3nM. Assay description: Binding affinity to Staphylococcus aureus FtsZ assessed as dissociation constant by isothermal titration calorimetry
Ligand InfoPC cidPC sid
In DepthDetails PubMed