BDBM50605151 CHEMBL5188114
SMILES [I-].CCCCCNc1cc(\C=C\c2ccc(cc2)N(C)C)[n+](C)c2ccccc12
InChI Key InChIKey=WHKNXMNUFMJOJB-KLSJZZFUSA-N
Data  1 Kd
  Tab Delimited (TSV)   2D SDfile   Computed 3D by Vconf -m prep SDfile
Find this compound or compounds like it in BindingDB:
Activity Spreadsheet -- Enzyme Inhibition Constant Data from BindingDB
Found 1 hit for monomerid = 50605151
TargetCell division protein FtsZ(Staphylococcus aureus)
Guangdong University Of Technology
Curated by ChEMBL
LigandPNGBDBM50605151(CHEMBL5188114)
Affinity DataKd:  2.38E+3nM. Assay description: Binding affinity to Staphylococcus aureus FtsZ assessed as dissociation constant by isothermal titration calorimetry
Ligand InfoPC cidPC sid
In DepthDetails PubMed